Home > Failed To > Spring Junit Java.lang.illegalstateexception Failed To Load Applicationcontext

Spring Junit Java.lang.illegalstateexception Failed To Load Applicationcontext

Contents

share|improve this answer answered Jun 27 '15 at 3:46 BharatB 11 add a comment| up vote 0 down vote I faced this problem when I had to maven install my project. Offending class: [org/springframework/transaction/interceptor/TransactionAttribute] Mar 02, 2016 1:01:41 AM org.springframework.test.context.support.DefaultTestContextBootstrapper getTestExecutionListeners INFO: Using TestExecutionListeners: [org.springframework.test[email protected]3aa9e816, org.springframewor[email protected]17d99928, org.springfra[email protected]3834d63f] Mar 02, 2016 1:01:41 AM org.springframework.context.support.GenericApplicationContext prepareRefresh INFO: Refreshing [email protected]6e8792: startup date [Wed Mar 02 Specify custom listener classes or make the default listener classes (and their required dependencies) available. java.lang.IllegalStateException: Failed to load ApplicationContext at org.springframework.test.context.TestContext.getApplicationContext(TestContext.java:157) at org.springframework.test.context.support.DependencyInjectionTestExecutionListener.injectDependencies(DependencyInjectionTestExecutionListener.java:109) at org.springframework.test.context.support.DependencyInjectionTestExecutionListener.prepareTestInstance(DependencyInjectionTestExecutionListener.java:75) at org.springframework.test.context.TestContextManager.prepareTestInstance(TestContextManager.java:321) at org.springframework.test.context.junit4.SpringJUnit4ClassRunner.createTest(SpringJUnit4ClassRunner.java:211) at org.springframework.test.context.junit4.SpringJUnit4ClassRunner$1.runReflectiveCall(SpringJUnit4ClassRunner.java:288) at org.junit.internal.runners.model.ReflectiveCallable.run(ReflectiveCallable.java:15) at org.springframework.test.context.junit4.SpringJUnit4ClassRunner.methodBlock(SpringJUnit4ClassRunner.java:290) at org.springframework.test.context.junit4.SpringJUnit4ClassRunner.runChild(SpringJUnit4ClassRunner.java:231) at org.junit.runners.BlockJUnit4ClassRunner.runChild(BlockJUnit4ClassRunner.java:49) at org.junit.runners.ParentRunner$3.run(ParentRunner.java:193) at org.junit.runners.ParentRunner$1.schedule(ParentRunner.java:52) at org.junit.runners.ParentRunner.runChildren(ParentRunner.java:191) http://computerhelpdev.com/failed-to/spring-failed-to-load-applicationcontext-junit.php

spring spring-mvc junit junit4 spring-mvc-test share|improve this question edited Jun 20 '13 at 19:45 Raedwald 18.2k1369107 asked Jun 20 '13 at 17:50 Saurabh 37341019 I think that WEB-INF location The answer provided by Martin Strejc worked for me. Comment Cancel Post conanzxn Junior Member Join Date: Aug 2012 Posts: 11 #4 Aug 30th, 2012, 03:33 AM The problem is solved. Encryption - How to claim authorship anonymously? http://stackoverflow.com/questions/24776669/failed-to-load-applicationcontext-from-unit-test-filenotfound

Failed To Load Applicationcontext Junit Spring Boot

What's the male version of "hottie"? Cryptic crossword clue Kids shuffling cards Parking lot supervisor Should we eliminate local variables if we can? Dependency annotations: {@org.springframework.beans.factory.annotation.Autowired(required=true)} at org.springframework.beans.factory.support.DefaultListableBeanFactory.raiseNoSuchBeanDefinitionException(DefaultListableBeanFactory.java:986) at org.springframework.beans.factory.support.DefaultListableBeanFactory.doResolveDependency(DefaultListableBeanFactory.java:856) at org.springframework.beans.factory.support.DefaultListableBeanFactory.resolveDependency(DefaultListableBeanFactory.java:768) at org.springframework.beans.factory.annotation.AutowiredAnnotationBeanPostProcessor$AutowiredFieldElement.inject(AutowiredAnnotationBeanPostProcessor.java:486) ... 46 more The log message says that you haven't defined MessageDAO: Caused by: org.springframework.beans.factory.NoSuchBeanDefinitionException: No qualifying bean of type Those needing community support and/or wanting to ask questions should refer to the Tag/Forum map, and to http://spring.io/questions for a curated list of stackoverflow tags that Pivotal engineers, and the community,

Is it a security vulnerability if the addresses of university students are exposed? Structure looks like this:project_mvn_module (pom.xml)     |-module_folder          |-server_folder               |-domain_mvn_module (pom.xml)               |-service_mvn_module (pom.xml)               |-service_impl_maven_module (pom.xml)               |-...                                       |-client_folder               |-controller_mvn_module (pom.xml)               |-webapp_mvn_module (pom.xml)                    |-main, resources, webapp folder, WEB-INF                    |-test, java folder                         |-AbstractControllerTest.java                         |-DashboardControllerTest.javaservlet-context.xml file is placed in: webapp_mvn_module/src/main/webapp/WEB-INF/ folder.   [email protected]@ContextConfiguration("file:**/servlet-context.xml")public class AbstractControllerTest {    @Autowired    protected WebApplicationContext wac;}[email protected](SpringJUnit4ClassRunner.class)public class DashboardControllerTest extends AbstractControllerTest Offending class: [javax/servlet/ServletContext] Mar 02, 2016 1:04:19 AM org.springframework.test.context.support.DefaultTestContextBootstrapper instantiateListeners INFO: Could not instantiate TestExecutionListener [org.springframework.test.context.transaction.TransactionalTestExecutionListener]. Failed To Load Applicationcontext Gradle Hot Network Questions Node modules have 755 permissions, what permissions should I set so that npm don't require sudo?

But when you run tests, it will not find it there, but src/test/resources. I use Hibernate3 + Spring3.1.1 + JUnit4.1 + Netbeans7.2 When I try to set up the unit test, it fails when I put "mappingLocations" in the spring application context file. Spring Unit Test Failed to Load ApplicationContext Page Title Module Move Remove Collapse X Conversation Detail Module Collapse Posts Latest Activity Search Forums Page of 1 Filter Time All Time Today Output N in base -10 Dealing with "friend" who won't pay after delivery despite signed contracts 12 hour to 24 hour time converter Does every data type just boil down to

How to deal with an intern's lack of basic skills? Could Not Load Cacheawarecontextloaderdelegate Would more Full Nodes help scaling and transaction speed? more stack exchange communities company blog Stack Exchange Inbox Reputation and Badges sign up log in tour help Tour Start here for a quick overview of the site Help Center Detailed Test class contains a @Configuration annotated static inner class which in turn contains bean definition beanA() annotated with @Bean.

Failed To Load Applicationcontext Junit Spring Maven

What does the expression 'seven for seven thirty ' mean? http://forum.spring.io/forum/spring-projects/data/120334-spring-unit-test-failed-to-load-applicationcontext Any ideas? Failed To Load Applicationcontext Junit Spring Boot My folder structure is: src/main/java -> sources src/main/resources -> a messages.properties file src/test/java -> dao package containing OfficialHolidayDAOTest src/test/resources -> applicationContext-test.xml My applicationContext.xml is found under src/main/webapp/WEB-INF I am trying to Java.lang.illegalstateexception: Failed To Load Applicationcontext Intellij format block of text What to do about a player who takes risks and dies (without consequence)?

Is it bad practice to use GET method as login username/password for administrators? this contact form So I just copied the contents of my spring-security into the applicationContext-test.xml. SpringTestWithNoContextConfigurationOrContextHierarchy: package com.javarticles.spring; import static org.junit.Assert.assertNotNull; import org.junit.Test; import org.junit.runner.RunWith; import org.springframework.beans.factory.annotation.Autowired; import org.springframework.context.annotation.Bean; import org.springframework.context.annotation.Configuration; import org.springframework.test.context.junit4.SpringJUnit4ClassRunner; @RunWith(SpringJUnit4ClassRunner.class) public class SpringTestWithNoContextConfigurationOrContextHierarchy { @Autowired private A beanA; @Test public void verifyBeanAConfigured() Mar 02, 2016 1:04:19 AM org.springframework.test.context.support.DefaultTestContextBootstrapper getDefaultTestExecutionListenerClassNames INFO: Loaded default TestExecutionListener class names from location [META-INF/spring.factories]: [org.springframework.test.context.web.ServletTestExecutionListener, org.springframework.test.context.support.DirtiesContextBeforeModesTestExecutionListener, org.springframework.test.context.support.DependencyInjectionTestExecutionListener, org.springframework.test.context.support.DirtiesContextTestExecutionListener, org.springframework.test.context.transaction.TransactionalTestExecutionListener, org.springframework.test.context.jdbc.SqlScriptsTestExecutionListener] Mar 02, 2016 1:04:19 AM org.springframework.test.context.support.DefaultTestContextBootstrapper instantiateListeners INFO: Could Caught Exception While Allowing Testexecutionlistener Failed To Load Applicationcontext

Are the guns on a fighter jet fixed or can they be aimed? I rather use test-app-context.xml for testing and app-context.xml to separate their usage and content. expl3/xparse: Having an **if check** in a command How can I take a photo through trees but focus on an object behind the trees? http://computerhelpdev.com/failed-to/failed-to-load-applicationcontext-junit-test.php at org.springframework.util.Assert.notNull(Assert.java:115) at org.springframework.test.context.cache.DefaultCacheAwareContextLoaderDelegate.loadContextInternal(DefaultCacheAwareContextLoaderDelegate.java:91) at org.springframework.test.context.cache.DefaultCacheAwareContextLoaderDelegate.loadContext(DefaultCacheAwareContextLoaderDelegate.java:116) ... 25 more Spring Tests with @ContextConfiguration Let's now annotate the test class with an empty @ContextConfiguration.

Mar 02, 2016 1:01:41 AM org.springframework.test.context.support.DefaultTestContextBootstrapper getDefaultTestExecutionListenerClassNames INFO: Loaded default TestExecutionListener class names from location [META-INF/spring.factories]: [org.springframework.test.context.web.ServletTestExecutionListener, org.springframework.test.context.support.DirtiesContextBeforeModesTestExecutionListener, org.springframework.test.context.support.DependencyInjectionTestExecutionListener, org.springframework.test.context.support.DirtiesContextTestExecutionListener, org.springframework.test.context.transaction.TransactionalTestExecutionListener, org.springframework.test.context.jdbc.SqlScriptsTestExecutionListener] Mar 02, 2016 1:01:41 AM org.springframework.test.context.support.DefaultTestContextBootstrapper instantiateListeners INFO: Could Java.lang.illegalstateexception Failed To Load Applicationcontext Gradle Their definitions are similar to resource elements, but are naturally used during test phases. Print all ASCII alphanumeric characters without using them Are people of Nordic Nations "happier, healthier" with "a higher standard of living overall than Americans"?

Consider annotating your test class with @ContextConfiguration or @ContextHierarchy.

J. Give an indeterminate limit of a function that is always indeterminate with iterated attempts at l'Hopital's Rule. Not the answer you're looking for? Java.lang.illegalstateexception Failed To Load Applicationcontext Junit Spring Boot share|improve this answer answered Nov 16 '16 at 16:23 Shanmukha Sampath Kumar 11 add a comment| Your Answer draft saved draft discarded Sign up or log in Sign up using

Thanks. Hot Network Questions Is this definition of convergence of a sequence equivalent to the actual definition? more hot questions question feed lang-java about us tour help blog chat data legal privacy policy work here advertising info mobile contact us feedback Technology Life / Arts Culture / Recreation Check This Out more hot questions question feed lang-java about us tour help blog chat data legal privacy policy work here advertising info mobile contact us feedback Technology Life / Arts Culture / Recreation

Annotate test class with @ContextConfiguration or @ContextHierarchy You must annotate the test classes with either @ContextConfiguration or @ContextHierarchy else the test will fail with a fatal error. Specify custom listener classes or make the default listener classes (and their required dependencies) available. Sort an array of integers into odd, then even Hacker used picture upload to get PHP code into my site Output N in base -10 Why does the `reset` command include Why isn't the religion of R'hllor, The Lord of Light, dominant?

Thanks! Keeping windshield ice-free without heater Are people of Nordic Nations "happier, healthier" with "a higher standard of living overall than Americans"? In this article, we will see several possibilities of providing context configuration details. java spring hibernate dependency-injection junit share|improve this question asked Feb 11 '13 at 22:53 AndaP 58041638 add a comment| 3 Answers 3 active oldest votes up vote 3 down vote The

Not the answer you're looking for? Klein Ikkink | Dark theme | Light theme Subscribe in a reader To use Google Groups Discussions, please enable JavaScript in your browser settings, and then refresh this page. . Not the answer you're looking for? Comment Cancel Post conanzxn Junior Member Join Date: Aug 2012 Posts: 11 #3 Aug 30th, 2012, 03:31 AM Originally posted by balteo View Post Hello, -Is your applicationContext_1.xml located at the

Specify custom listener classes or make the default listener classes (and their required dependencies) available. Sort Characters By Frequency 12 hour to 24 hour time converter Why am I seeing more notes than allowed to be in a bar? I was trying to load the dispatcher-servlet.xml present in the Web-INF directory of the applicaion, but it was failing. Is it a security vulnerability if the addresses of university students are exposed?

SpringTestWithContextHierarchy: package com.javarticles.spring; import static org.junit.Assert.assertNotNull; import org.junit.Test; import org.junit.runner.RunWith; import org.springframework.beans.factory.annotation.Autowired; import org.springframework.context.annotation.Bean; import org.springframework.context.annotation.Configuration; import org.springframework.test.context.ContextConfiguration; import org.springframework.test.context.ContextHierarchy; import org.springframework.test.context.junit4.SpringJUnit4ClassRunner; @RunWith(SpringJUnit4ClassRunner.class) @ContextHierarchy(@ContextConfiguration) public class SpringTestWithContextHierarchy { @Autowired private A Dependency annotations: {@org.springframework.beans.factory.annotation.Autowired(required=true)} at org.springframework.beans.factory.annotation.AutowiredAnnotationBeanPostProcessor$AutowiredFieldElement.inject(AutowiredAnnotationBeanPostProcessor.java:514) at org.springframework.beans.factory.annotation.InjectionMetadata.inject(InjectionMetadata.java:87) at org.springframework.beans.factory.annotation.AutowiredAnnotationBeanPostProcessor.postProcessPropertyValues(AutowiredAnnotationBeanPostProcessor.java:285) ... 44 more Caused by: org.springframework.beans.factory.NoSuchBeanDefinitionException: No qualifying bean of type [com.johnathanmarksmith.hellospring.dao.MessageDao] found for dependency: expected at least 1 bean which qualifies The complete stack trace is this: java.lang.IllegalStateException: Failed to load ApplicationContext at org.springframework.test.context.CacheAwareContextLoaderDelegate.loadContext(CacheAwareContextLoaderDelegate.java:99) at org.springframework.test.context.DefaultTestContext.getApplicationContext(DefaultTestContext.java:101) at org.springframework.test.context.support.DependencyInjectionTestExecutionListener.injectDependencies(DependencyInjectionTestExecutionListener.java:109) at org.springframework.test.context.support.DependencyInjectionTestExecutionListener.prepareTestInstance(DependencyInjectionTestExecutionListener.java:75) at org.springframework.test.context.TestContextManager.prepareTestInstance(TestContextManager.java:331) at org.springframework.test.context.junit4.SpringJUnit4ClassRunner.createTest(SpringJUnit4ClassRunner.java:213) at org.springframework.test.context.junit4.SpringJUnit4ClassRunner$1.runReflectiveCall(SpringJUnit4ClassRunner.java:290) at org.junit.internal.runners.model.ReflectiveCallable.run(ReflectiveCallable.java:12) at org.springframework.test.context.junit4.SpringJUnit4ClassRunner.methodBlock(SpringJUnit4ClassRunner.java:292) at org.springframework.test.context.junit4.SpringJUnit4ClassRunner.runChild(SpringJUnit4ClassRunner.java:233) From Maven POM Reference: The testResources element block contains testResource elements.

Specify custom listener classes or make the default listener classes (and their required dependencies) available. At what point is brevity no longer a virtue?